C++ 초보 에러 질문 드려요

조회수 64회

빌드 솔루션을 하면 해당 오류가 발생합니다. C++ 도 처음이고 비주얼 스튜디오도 처음이라서 왜 이 오류가 뜨는지 잘 모르겠어요 ㅠㅠ

1>------ Build started: Project: Project1, Configuration: Release Win32 ------ 1>MSVCRT.lib(exe_main.obj) : error LNK2001: unresolved external symbol _main 1>D:\UUU\CNB\Library\C1\Release\Project1.exe : fatal error LNK1120: 1 unresolved externals 1>Done building project "Project1.vcxproj" -- FAILED. ========== Build: 0 succeeded, 1 failed, 0 up-to-date, 0 skipped ==========

답변을 하려면 로그인이 필요합니다.

Hashcode는 개발자들을 위한 무료 QnA 사이트입니다. 계정을 생성하셔야만 답변을 작성하실 수 있습니다.

(ಠ_ಠ)
(ಠ‿ಠ)

ᕕ( ᐛ )ᕗ
로그인이 필요합니다

Hashcode는 개발자들을 위한 무료 QnA사이트 입니다. 계정을 생성하셔야만 글을 작성하실 수 있습니다.